tests/test-mq-missingfiles.t
author Gregory Szorc <gregory.szorc@gmail.com>
Tue, 22 Apr 2014 10:05:32 -0700
changeset 21504 888a5dfe1569
parent 16813 6d42c797ca6e
child 24365 f1eaf03dd608
permissions -rw-r--r--
run-tests: pass temp dir into Test.__init__ This patch starts a mini series of moving arguments to Test.__init__ from semi-complex data structures (such as the command options) to named arguments. This will allow Test instances to be more easily instantiated from other contexts. This improves the ability to run Mercurial tests in new and different environments.


Issue835: qpush fails immediately when patching a missing file, but
remaining added files are still created empty which will trick a
future qrefresh.

  $ cat > writelines.py <<EOF
  > import sys
  > path = sys.argv[1]
  > args = sys.argv[2:]
  > assert (len(args) % 2) == 0
  > 
  > f = file(path, 'wb')
  > for i in xrange(len(args)/2):
  >    count, s = args[2*i:2*i+2]
  >    count = int(count)
  >    s = s.decode('string_escape')
  >    f.write(s*count)
  > f.close()
  > EOF

  $ echo "[extensions]" >> $HGRCPATH
  $ echo "mq=" >> $HGRCPATH

  $ hg init normal
  $ cd normal
  $ python ../writelines.py b 10 'a\n'
  $ hg ci -Am addb
  adding b
  $ echo a > a
  $ python ../writelines.py b 2 'b\n' 10 'a\n' 2 'c\n'
  $ echo c > c
  $ hg add a c
  $ hg qnew -f changeb
  $ hg qpop
  popping changeb
  patch queue now empty
  $ hg rm b
  $ hg ci -Am rmb

Push patch with missing target:

  $ hg qpush
  applying changeb
  unable to find 'b' for patching
  2 out of 2 hunks FAILED -- saving rejects to file b.rej
  patch failed, unable to continue (try -v)
  patch failed, rejects left in working dir
  errors during apply, please fix and refresh changeb
  [2]

Display added files:

  $ cat a
  a
  $ cat c
  c

Display rejections:

  $ cat b.rej
  --- b
  +++ b
  @@ -1,3 +1,5 @@
  +b
  +b
   a
   a
   a
  @@ -8,3 +10,5 @@
   a
   a
   a
  +c
  +c

Test missing renamed file

  $ hg qpop
  popping changeb
  patch queue now empty
  $ hg up -qC 0
  $ echo a > a
  $ hg mv b bb
  $ python ../writelines.py bb 2 'b\n' 10 'a\n' 2 'c\n'
  $ echo c > c
  $ hg add a c
  $ hg qnew changebb
  $ hg qpop
  popping changebb
  patch queue now empty
  $ hg up -qC 1
  $ hg qpush
  applying changebb
  patching file bb
  Hunk #1 FAILED at 0
  Hunk #2 FAILED at 7
  2 out of 2 hunks FAILED -- saving rejects to file bb.rej
  b not tracked!
  patch failed, unable to continue (try -v)
  patch failed, rejects left in working dir
  errors during apply, please fix and refresh changebb
  [2]
  $ cat a
  a
  $ cat c
  c
  $ cat bb.rej
  --- bb
  +++ bb
  @@ -1,3 +1,5 @@
  +b
  +b
   a
   a
   a
  @@ -8,3 +10,5 @@
   a
   a
   a
  +c
  +c

  $ cd ..


  $ echo "[diff]" >> $HGRCPATH
  $ echo "git=1" >> $HGRCPATH

  $ hg init git
  $ cd git
  $ python ../writelines.py b 1 '\x00'
  $ hg ci -Am addb
  adding b
  $ echo a > a
  $ python ../writelines.py b 1 '\x01' 1 '\x00'
  $ echo c > c
  $ hg add a c
  $ hg qnew -f changeb
  $ hg qpop
  popping changeb
  patch queue now empty
  $ hg rm b
  $ hg ci -Am rmb

Push git patch with missing target:

  $ hg qpush
  applying changeb
  unable to find 'b' for patching
  1 out of 1 hunks FAILED -- saving rejects to file b.rej
  patch failed, unable to continue (try -v)
  patch failed, rejects left in working dir
  errors during apply, please fix and refresh changeb
  [2]
  $ hg st
  ? b.rej

Display added files:

  $ cat a
  a
  $ cat c
  c

Display rejections:

  $ cat b.rej
  --- b
  +++ b
  GIT binary patch
  literal 2
  Jc${No0000400IC2
  
  $ cd ..

Test push creating directory during git copy or rename:

  $ hg init missingdir
  $ cd missingdir
  $ echo a > a
  $ hg ci -Am adda
  adding a
  $ mkdir d
  $ hg copy a d/a2
  $ hg mv a d/a
  $ hg qnew -g -f patch
  $ hg qpop
  popping patch
  patch queue now empty
  $ hg qpush
  applying patch
  now at: patch

  $ cd ..